BDBM50107516 5-(4-Methanesulfonyl-phenyl)-2-methyl-4-phenyl-oxazole::CHEMBL350549
SMILES Cc1nc(c(o1)-c1ccc(cc1)S(C)(=O)=O)-c1ccccc1
InChI Key InChIKey=AAVJWYXBVYXAAN-UHFFFAOYSA-N
Data  2 IC50
  Tab Delimited (TSV)   2D SDfile   Computed 3D by Vconf -m prep SDfile
Find this compound or compounds like it in BindingDB:
Activity Spreadsheet -- Enzyme Inhibition Constant Data from BindingDB
Found 2 hits for monomerid = 50107516
TargetProstaglandin G/H synthase 2(Homo sapiens (Human))
Central Pharmaceutical Research Institute
Curated by ChEMBL
LigandPNGBDBM50107516(5-(4-Methanesulfonyl-phenyl)-2-methyl-4-phenyl-oxa...)
Affinity DataIC50:  90nM. Assay description: In vitro inhibitory activity of the compound towards human recombinant Prostaglandin G/H synthase 2 enzyme
In DepthDetails ArticlePubMed
TargetProstaglandin G/H synthase 1(Homo sapiens (Human))
Central Pharmaceutical Research Institute
Curated by ChEMBL
LigandPNGBDBM50107516(5-(4-Methanesulfonyl-phenyl)-2-methyl-4-phenyl-oxa...)
Affinity DataIC50: >1.00E+5nM. Assay description: In vitro inhibitory activity of the compound towards human platelet recombinant Prostaglandin G/H synthase 1
In DepthDetails ArticlePubMed