BDBM50107982 6-[(2-Fluoro-5-methyl-phenylamino)-methyl]-5-methyl-pyrido[2,3-d]pyrimidine-2,4-diamine::CHEMBL348209
SMILES Cc1ccc(F)c(NCc2cnc3nc(N)nc(N)c3c2C)c1
InChI Key InChIKey=MVPSRHHEAKHSAK-UHFFFAOYSA-N
Data  2 IC50
  Tab Delimited (TSV)   2D SDfile   Computed 3D by Vconf -m prep SDfile
Find this compound or compounds like it in BindingDB:
Activity Spreadsheet -- Enzyme Inhibition Constant Data from BindingDB
Found 2 hits for monomerid = 50107982
TargetDihydrofolate reductase(Homo sapiens (Human))
Lindsley F. Kimball Research Institute
Curated by ChEMBL
LigandPNGBDBM50107982(6-[(2-Fluoro-5-methyl-phenylamino)-methyl]-5-methy...)
Affinity DataIC50:  250nM. Assay description: Antimycobacterial activity against human dihydrofolate reductase (hDHFR)
In DepthDetails ArticlePubMed
TargetDihydrofolate reductase(Homo sapiens (Human))
Lindsley F. Kimball Research Institute
Curated by ChEMBL
LigandPNGBDBM50107982(6-[(2-Fluoro-5-methyl-phenylamino)-methyl]-5-methy...)
Affinity DataIC50:  1.10nM. Assay description: Antimycobacterial activity against Mycobacterium avium complex diihydrofolate reductase (MAC DHFR)
In DepthDetails ArticlePubMed