BDBM50108586 2-Propyl-pentanoic acid (3-methyl-5-sulfamoyl-3H-[1,3,4]thiadiazol-2-ylidene)-amide::CHEMBL419553
SMILES CCCC(CCC)C(=O)N=c1sc(nn1C)S(N)(=O)=O
InChI Key InChIKey=MWRBLUKUVJNMEJ-UHFFFAOYSA-N
Data  3 KI
  Tab Delimited (TSV)   2D SDfile   Computed 3D by Vconf -m prep SDfile
Find this compound or compounds like it in BindingDB:
Activity Spreadsheet -- Enzyme Inhibition Constant Data from BindingDB
Found 3 hits for monomerid = 50108586
TargetCarbonic anhydrase 2(Homo sapiens (Human))
University Of Namur
Curated by ChEMBL
LigandPNGBDBM50108586(2-Propyl-pentanoic acid (3-methyl-5-sulfamoyl-3H-[...)
Affinity DataKi:  10nM. Assay description: Inhibitory effect on human Carbonic anhydrase II
In DepthDetails ArticlePubMed
TargetCarbonic anhydrase 4(Bos taurus (bovine))
University Of Namur
Curated by ChEMBL
LigandPNGBDBM50108586(2-Propyl-pentanoic acid (3-methyl-5-sulfamoyl-3H-[...)
Affinity DataKi:  42nM. Assay description: Inhibitory effect on bovine Carbonic anhydrase IV
In DepthDetails ArticlePubMed
TargetCarbonic anhydrase 1(Homo sapiens (Human))
University Of Namur
Curated by ChEMBL
LigandPNGBDBM50108586(2-Propyl-pentanoic acid (3-methyl-5-sulfamoyl-3H-[...)
Affinity DataKi:  70nM. Assay description: Inhibitory effect on human carbonic anhydrase I
In DepthDetails ArticlePubMed