BDBM50109719 2-(3-Benzoyl-4-ethyl-phenyl)-ethenesulfonic acid amide::CHEMBL147189
SMILES CCc1ccc(\C=C\S(N)(=O)=O)cc1C(=O)c1ccccc1
InChI Key InChIKey=IFODKGWTTXTEEP-ZHACJKMWSA-N
Data  2 IC50
  Tab Delimited (TSV)   2D SDfile   Computed 3D by Vconf -m prep SDfile
Find this compound or compounds like it in BindingDB:
Activity Spreadsheet -- Enzyme Inhibition Constant Data from BindingDB
Found 2 hits for monomerid = 50109719
TargetProstaglandin G/H synthase 2(Homo sapiens (Human))
Laboratorios Menarini
Curated by ChEMBL
LigandPNGBDBM50109719(2-(3-Benzoyl-4-ethyl-phenyl)-ethenesulfonic acid a...)
Affinity DataIC50:  770nM. Assay description: In vitro inhibition of PGE-2 generation by LPS-stimulated monocytes isolated from human blood.
In DepthDetails ArticlePubMed
TargetProstaglandin G/H synthase 1(Homo sapiens (Human))
Laboratorios Menarini
Curated by ChEMBL
LigandPNGBDBM50109719(2-(3-Benzoyl-4-ethyl-phenyl)-ethenesulfonic acid a...)
Affinity DataIC50:  200nM. Assay description: In vitro inhibition of cyclooxygenase-1 by inhibition of TXB2 generation with 1 uM arachidonic acid in human platelets
In DepthDetails ArticlePubMed