BDBM50109727 2-(3-Benzoyl-5-diethylaminomethyl-phenyl)-ethenesulfonic acid amide::CHEMBL150340
SMILES CCN(CC)Cc1cc(\C=C\S(N)(=O)=O)cc(c1)C(=O)c1ccccc1
InChI Key InChIKey=MGKBPLMUAUASJU-ZHACJKMWSA-N
Data  1 IC50
  Tab Delimited (TSV)   2D SDfile   Computed 3D by Vconf -m prep SDfile
Find this compound or compounds like it in BindingDB:
Activity Spreadsheet -- Enzyme Inhibition Constant Data from BindingDB
Found 1 hit for monomerid = 50109727
TargetProstaglandin G/H synthase 2(Homo sapiens (Human))
Laboratorios Menarini
Curated by ChEMBL
LigandPNGBDBM50109727(2-(3-Benzoyl-5-diethylaminomethyl-phenyl)-ethenesu...)
Affinity DataIC50:  7.10E+3nM. Assay description: In vitro inhibition of PGE-2 generation by LPS-stimulated monocytes isolated from human blood.
In DepthDetails ArticlePubMed