BDBM50110810 CHEMBL3606009::US10800739, Compound (9)::US11420940, cpd (9)
SMILES NC(=O)c1cccc2CN(C3CCN(Cc4cccs4)CC3)C(=O)c12
InChI Key InChIKey=VASLQBSSVPMGKR-UHFFFAOYSA-N
Data  6 Kd
  Tab Delimited (TSV)   2D SDfile   Computed 3D by Vconf -m prep SDfile
Find this compound or compounds like it in BindingDB:
Activity Spreadsheet -- Enzyme Inhibition Constant Data from BindingDB
Found 6 hits for monomerid = 50110810
TargetPoly [ADP-ribose] polymerase 1(Homo sapiens (Human))
Nerviano Medical Sciences
Curated by ChEMBL
LigandPNGBDBM50110810(CHEMBL3606009 | US10800739, Compound (9) | US11420...)
Affinity DataKd: <30nM. Assay description: Binding affinity to full length recombinant human PARP-1 by fluorescence polarization displacement assay
In DepthDetails ArticlePubMed
TargetPoly [ADP-ribose] polymerase 2(Homo sapiens (Human))
Nerviano Medical Sciences
Curated by ChEMBL
LigandPNGBDBM50110810(CHEMBL3606009 | US10800739, Compound (9) | US11420...)
Affinity DataKd:  1.44E+3nM. Assay description: Binding affinity to full length recombinant human PARP-2 by fluorescence polarization displacement assay
In DepthDetails ArticlePubMed
TargetPoly [ADP-ribose] polymerase 2(Homo sapiens (Human))
Nerviano Medical Sciences
Curated by ChEMBL
LigandPNGBDBM50110810(CHEMBL3606009 | US10800739, Compound (9) | US11420...)
Affinity DataKd:  1.44E+3nM. Assay description: The assay is based on the use of a probe of formula (IP) that binds to the NAD binding pocket and takes advantage of the significant change in the po...
In DepthDetails US Patent
TargetPoly [ADP-ribose] polymerase 2(Homo sapiens (Human))
Nerviano Medical Sciences
Curated by ChEMBL
LigandPNGBDBM50110810(CHEMBL3606009 | US10800739, Compound (9) | US11420...)
Affinity DataKd:  1.44E+3nM. Assay description: Preferably, for the screening method above cited, both the PARP protein and the 5H-phenanthridin-6-one-derived probe of formula (IP) are pre-mixed, o...
In DepthDetails US Patent
TargetPoly [ADP-ribose] polymerase 1(Homo sapiens (Human))
Nerviano Medical Sciences
Curated by ChEMBL
LigandPNGBDBM50110810(CHEMBL3606009 | US10800739, Compound (9) | US11420...)
Affinity DataKd: <30nM. Assay description: The assay is based on the use of a probe of formula (IP) that binds to the NAD binding pocket and takes advantage of the significant change in the po...
In DepthDetails US Patent
TargetPoly [ADP-ribose] polymerase 1(Homo sapiens (Human))
Nerviano Medical Sciences
Curated by ChEMBL
LigandPNGBDBM50110810(CHEMBL3606009 | US10800739, Compound (9) | US11420...)
Affinity DataKd: <30nM. Assay description: Preferably, for the screening method above cited, both the PARP protein and the 5H-phenanthridin-6-one-derived probe of formula (IP) are pre-mixed, o...
In DepthDetails US Patent