BDBM50113391 CHEMBL287359::N-{4-[(R)-1-(3-Cyclopentyloxy-4-methoxy-phenyl)-2-pyridin-4-yl-ethyl]-phenyl}-C-phenyl-methanesulfonamide
SMILES COc1ccc(cc1OC1CCCC1)[C@H](Cc1ccncc1)c1ccc(NS(=O)(=O)Cc2ccccc2)cc1
InChI Key InChIKey=PMJXEGJTSFCNHP-SSEXGKCCSA-N
Data  1 IC50
  Tab Delimited (TSV)   2D SDfile   Computed 3D by Vconf -m prep SDfile
Find this compound or compounds like it in BindingDB:
Activity Spreadsheet -- Enzyme Inhibition Constant Data from BindingDB
Found 1 hit for monomerid = 50113391
TargetcAMP-specific 3',5'-cyclic phosphodiesterase 4A(Homo sapiens (Human))
Celltech R&D
Curated by ChEMBL
LigandPNGBDBM50113391(CHEMBL287359 | N-{4-[(R)-1-(3-Cyclopentyloxy-4-met...)
Affinity DataIC50:  8nM. Assay description: Inhibition of human recombinant phosphodiesterase 4A
In DepthDetails ArticlePubMed