BDBM50116012 3-{4-[(aminosulfonyl)oxy]benzoyl}phenyl sulfamate::CHEMBL65211
SMILES NS(=O)(=O)Oc1ccc(cc1)C(=O)c1cccc(OS(N)(=O)=O)c1
InChI Key InChIKey=NEMACRXQAFHGPF-UHFFFAOYSA-N
Data  1 IC50
  Tab Delimited (TSV)   2D SDfile   Computed 3D by Vconf -m prep SDfile
Find this compound or compounds like it in BindingDB:
Activity Spreadsheet -- Enzyme Inhibition Constant Data from BindingDB
Found 1 hit for monomerid = 50116012
TargetSteryl-sulfatase(Homo sapiens (Human))
Novartis Research Institute Vienna
Curated by ChEMBL
LigandPNGBDBM50116012(3-{4-[(aminosulfonyl)oxy]benzoyl}phenyl sulfamate ...)
Affinity DataIC50:  780nM. Assay description: Inhibition of human steroid sulfatase compared to EMATE
In DepthDetails ArticlePubMed