BDBM50117816 CHEMBL3613931::US9505753, 5c
SMILES Oc1nn(CCc2cccc(F)c2)c(=O)[nH]c1=O
InChI Key InChIKey=ASIKUSSKCRFBKC-UHFFFAOYSA-N
Data  2 IC50
  Tab Delimited (TSV)   2D SDfile   Computed 3D by Vconf -m prep SDfile
Find this compound or compounds like it in BindingDB:
Activity Spreadsheet -- Enzyme Inhibition Constant Data from BindingDB
Found 2 hits for monomerid = 50117816
TargetD-amino-acid oxidase(Homo sapiens (Human))
Johns Hopkins University
Curated by ChEMBL
LigandPNGBDBM50117816(CHEMBL3613931 | US9505753, 5c)
Affinity DataIC50:  60nM. Assay description: Inhibition of recombinant human DAAO expressed in HEK cells using D-serine as substrate assessed as formation of alpha-keto acid, ammonia, hydrogen p...
In DepthDetails ArticlePubMed
TargetD-amino-acid oxidase(Homo sapiens (Human))
Johns Hopkins University
Curated by ChEMBL
LigandPNGBDBM50117816(CHEMBL3613931 | US9505753, 5c)
Affinity DataIC50:  60nMpH: 8.5 T: 2°C. Assay description: A reliable 96-well plate D-amino acid oxidase (DAAO) assay was developed based on previously published reports (J. Biol. Chem. 277: 27782 (2002)). Br...
In DepthDetails US Patent