BDBM50122336 (S)-2-Ethoxy-3-{4-[(Z)-3-(4-furan-2-yl-phenyl)-3-phenyl-allyloxy]-phenyl}-propionic acid::CHEMBL89996
SMILES CCO[C@@H](Cc1ccc(OC\C=C(\c2ccccc2)c2ccc(cc2)-c2ccco2)cc1)C(O)=O
InChI Key InChIKey=XHKNGLNAUZPBHP-HDFSHUSISA-N
Data  3 EC50
  Tab Delimited (TSV)   2D SDfile   Computed 3D by Vconf -m prep SDfile
Find this compound or compounds like it in BindingDB:
Activity Spreadsheet -- Enzyme Inhibition Constant Data from BindingDB
Found 3 hits for monomerid = 50122336
TargetPeroxisome proliferator-activated receptor gamma(Homo sapiens (Human))
Novo Nordisk
Curated by ChEMBL
LigandPNGBDBM50122336((S)-2-Ethoxy-3-{4-[(Z)-3-(4-furan-2-yl-phenyl)-3-p...)
Affinity DataEC50:  2.00E+3nM. Assay description: In vitro activation of human peroxisome proliferator activated receptor gamma (PPAR gamma)
In DepthDetails ArticlePubMed
TargetPeroxisome proliferator-activated receptor delta(Homo sapiens (Human))
Novo Nordisk
Curated by ChEMBL
LigandPNGBDBM50122336((S)-2-Ethoxy-3-{4-[(Z)-3-(4-furan-2-yl-phenyl)-3-p...)
Affinity DataEC50:  2.00E+3nM. Assay description: In vitro activation of human peroxisome proliferator activated receptor delta (PPAR delta)
In DepthDetails ArticlePubMed
TargetPeroxisome proliferator-activated receptor alpha(Homo sapiens (Human))
Novo Nordisk
Curated by ChEMBL
LigandPNGBDBM50122336((S)-2-Ethoxy-3-{4-[(Z)-3-(4-furan-2-yl-phenyl)-3-p...)
Affinity DataEC50:  400nM. Assay description: In vitro activation of human peroxisome proliferator activated receptor alpha
In DepthDetails ArticlePubMed