BDBM50123885 Benzoyl-(4-fluoro-phenyl)-thiocarbamic acid O-(2-phenoxy-ethyl) ester::CHEMBL164006
SMILES Fc1ccc(cc1)N(C(=S)OCCOc1ccccc1)C(=O)c1ccccc1
InChI Key InChIKey=HGDXWFZOCDJBAX-UHFFFAOYSA-N
Data  1 EC50
  Tab Delimited (TSV)   2D SDfile   Computed 3D by Vconf -m prep SDfile
Find this compound or compounds like it in BindingDB:
Activity Spreadsheet -- Enzyme Inhibition Constant Data from BindingDB
Found 1 hit for monomerid = 50123885
TargetReverse transcriptase/RNaseH(Human immunodeficiency virus 1)
Università
Curated by ChEMBL
LigandPNGBDBM50123885(Benzoyl-(4-fluoro-phenyl)-thiocarbamic acid O-(2-p...)
Affinity DataEC50:  4.00E+3nM. Assay description: Concentration required to achieve 50% protection of MT-4 cell from the HIV-1 induced cytopathogenicity was determined by the MTT method
In DepthDetails ArticlePubMed