BDBM50123894 CHEMBL165288::Phenyl-(3-phenyl-acryloyl)-thiocarbamic acid O-phenethyl ester
SMILES O=C(\C=C\c1ccccc1)N(C(=S)OCCc1ccccc1)c1ccccc1
InChI Key InChIKey=HNMNVBZJENEDFS-WUKNDPDISA-N
Data  1 EC50
  Tab Delimited (TSV)   2D SDfile   Computed 3D by Vconf -m prep SDfile
Find this compound or compounds like it in BindingDB:
Activity Spreadsheet -- Enzyme Inhibition Constant Data from BindingDB
Found 1 hit for monomerid = 50123894
TargetReverse transcriptase/RNaseH(Human immunodeficiency virus 1)
Università
Curated by ChEMBL
LigandPNGBDBM50123894(CHEMBL165288 | Phenyl-(3-phenyl-acryloyl)-thiocarb...)
Affinity DataEC50:  4.50E+3nM. Assay description: Concentration required to achieve 50% protection of MT-4 cell from the HIV-1 induced cytopathogenicity was determined by the MTT method
In DepthDetails ArticlePubMed