BDBM50123960 (E)-N-(2-Amino-phenyl)-3-[4-(3,4-dimethoxy-benzenesulfonylamino)-phenyl]-acrylamide::CHEMBL149444::N-(2-Amino-phenyl)-3-[4-(3,4-dimethoxy-benzenesulfonylamino)-phenyl]-acrylamide::US8796330, 116
SMILES COc1ccc(cc1OC)S(=O)(=O)Nc1ccc(\C=C\C(=O)Nc2ccccc2N)cc1
InChI Key InChIKey=DNINPOWJJPWIQI-NTEUORMPSA-N
Data  3 IC50
  Tab Delimited (TSV)   2D SDfile   Computed 3D by Vconf -m prep SDfile
Find this compound or compounds like it in BindingDB:
Activity Spreadsheet -- Enzyme Inhibition Constant Data from BindingDB
Found 3 hits for monomerid = 50123960
TargetHistone deacetylase 1(Homo sapiens (Human))
Methylgene
US Patent
LigandPNGBDBM50123960((E)-N-(2-Amino-phenyl)-3-[4-(3,4-dimethoxy-benzene...)
Affinity DataIC50:  4.00E+3nMT: 2°C. Assay description: For deacetylase assays, 20,000 cpm of the [3H]-metabolically labeled acetylated histone substrate (M. Yoshida et al., J. Biol. Chem. 265(28): 17174-1...
In DepthDetails US Patent
TargetHistone deacetylase 1(Homo sapiens (Human))
Methylgene
US Patent
LigandPNGBDBM50123960((E)-N-(2-Amino-phenyl)-3-[4-(3,4-dimethoxy-benzene...)
Affinity DataIC50:  4.00E+3nM. Assay description: Inhibitory concentration against human Histone deacetylase 1
In DepthDetails ArticlePubMed
TargetHistone deacetylase 1(Homo sapiens (Human))
Methylgene
US Patent
LigandPNGBDBM50123960((E)-N-(2-Amino-phenyl)-3-[4-(3,4-dimethoxy-benzene...)
Affinity DataIC50:  4.00E+3nM. Assay description: Inhibitory activity on partially purified recombinant human Histone deacetylase 1 (HDAC-1)
In DepthDetails ArticlePubMed