BDBM50124332 CHEMBL170355::Sodium; 4-{3-[2-amino-3-cyano-6-(2-methoxy-phenyl)-pyridin-4-yl]-phenylcarbamoyl}-4-hydroxy-butyrate
SMILES COc1ccccc1-c1cc(-c2cccc(NC(=O)C(O)CCC([O-])=O)c2)c(C#N)c(N)n1
InChI Key InChIKey=DPRJAJBHZRWRCZ-UHFFFAOYSA-M
Data  1 IC50
  Tab Delimited (TSV)   2D SDfile   Computed 3D by Vconf -m prep SDfile
Find this compound or compounds like it in BindingDB:
Activity Spreadsheet -- Enzyme Inhibition Constant Data from BindingDB
Found 1 hit for monomerid = 50124332
TargetInhibitor of nuclear factor kappa-B kinase subunit beta(Homo sapiens (Human))
Kyoto 619-0216
Curated by ChEMBL
LigandPNGBDBM50124332(CHEMBL170355 | Sodium; 4-{3-[2-amino-3-cyano-6-(2-...)
Affinity DataIC50: >2.00E+4nM. Assay description: In vitro inhibitory concentration required against recombinant human IkB kinase beta (IKK-beta)
In DepthDetails ArticlePubMed