BDBM50124334 CHEMBL444345::Sodium; 4-[3-(2-amino-3-cyano-6-phenyl-pyridin-4-yl)-phenylcarbamoyl]-4-hydroxy-butyrate
SMILES Nc1nc(cc(-c2cccc(NC(=O)C(O)CCC([O-])=O)c2)c1C#N)-c1ccccc1
InChI Key InChIKey=CGKAYBOHIFHJEQ-UHFFFAOYSA-M
Data  1 IC50
  Tab Delimited (TSV)   2D SDfile   Computed 3D by Vconf -m prep SDfile
Find this compound or compounds like it in BindingDB:
Activity Spreadsheet -- Enzyme Inhibition Constant Data from BindingDB
Found 1 hit for monomerid = 50124334
TargetInhibitor of nuclear factor kappa-B kinase subunit beta(Homo sapiens (Human))
Kyoto 619-0216
Curated by ChEMBL
LigandPNGBDBM50124334(CHEMBL444345 | Sodium; 4-[3-(2-amino-3-cyano-6-phe...)
Affinity DataIC50: >2.00E+4nM. Assay description: In vitro inhibitory concentration required against recombinant human IkB kinase beta (IKK-beta)
In DepthDetails ArticlePubMed