BDBM50126588 CHEMBL32851::N-[(S)-1-(3-Bromo-phenyl)-ethyl]-2-[3-(4-carbamimidoyl-phenyl)-ureido]-2-phenyl-acetamide
SMILES C[C@H](NC(=O)C(NC(=O)Nc1ccc(cc1)C(N)=N)c1ccccc1)c1cccc(Br)c1
InChI Key InChIKey=CYHCXTJUTDNJEJ-ZDGMYTEDSA-N
Data  1 KI
  Tab Delimited (TSV)   2D SDfile   Computed 3D by Vconf -m prep SDfile
Find this compound or compounds like it in BindingDB:
Activity Spreadsheet -- Enzyme Inhibition Constant Data from BindingDB
Found 1 hit for monomerid = 50126588
TargetCoagulation factor VII(Homo sapiens (Human))
Aventis Pharma Deutschland
Curated by ChEMBL
LigandPNGBDBM50126588(CHEMBL32851 | N-[(S)-1-(3-Bromo-phenyl)-ethyl]-2-[...)
Affinity DataKi:  3.20E+3nM. Assay description: In vitro inhibitory activity against coagulation factor VII (fVIIa)
In DepthDetails ArticlePubMed