BDBM50126665 2-[(4-Bromo-benzyl)-(2,4-dichloro-benzoyl)-amino]-3-phenyl-propionic acid::CHEMBL279214
SMILES OC(=O)[C@H](Cc1ccccc1)N(Cc1ccc(Br)cc1)C(=O)c1ccc(Cl)cc1Cl
InChI Key InChIKey=GJINDSMMMSBEKA-UHFFFAOYSA-N
Data  1 IC50
  Tab Delimited (TSV)   2D SDfile   Computed 3D by Vconf -m prep SDfile
Find this compound or compounds like it in BindingDB:
Activity Spreadsheet -- Enzyme Inhibition Constant Data from BindingDB
Found 1 hit for monomerid = 50126665
TargetRNA-directed RNA polymerase(Hepatitis C virus)
Shire Biochem
Curated by ChEMBL
LigandPNGBDBM50126665(2-[(4-Bromo-benzyl)-(2,4-dichloro-benzoyl)-amino]-...)
Affinity DataIC50:  9.10E+3nM. Assay description: Inhibitory activity against Hepatitis C RNA dependent RNA polymerase Nonstructural protein 5B (NS5B polymerase) expressed from baculovirus-infected S...
In DepthDetails ArticlePubMed