BDBM50127189 2-[3-[(Butyl-methyl-amino)-methyl]-8-(2-fluoro-benzyl)-6-(3-methoxy-phenyl)-7-methyl-5-oxo-5,8-dihydro-imidazo[1,2-a]pyrimidin-2-yl]-2-methyl-propionic acid methyl ester::CHEMBL49872
SMILES CCCCN(C)Cc1c(nc2n(Cc3ccccc3F)c(C)c(-c3cccc(OC)c3)c(=O)n12)C(C)(C)C(=O)OC
InChI Key InChIKey=PTJQEXXFDKQRCI-UHFFFAOYSA-N
Data  1 KI
  Tab Delimited (TSV)   2D SDfile   Computed 3D by Vconf -m prep SDfile
Find this compound or compounds like it in BindingDB:
Activity Spreadsheet -- Enzyme Inhibition Constant Data from BindingDB
Found 1 hit for monomerid = 50127189
TargetGonadotropin-releasing hormone receptor(Homo sapiens (Human))
Neurocrine Biosciences
Curated by ChEMBL
LigandPNGBDBM50127189(2-[3-[(Butyl-methyl-amino)-methyl]-8-(2-fluoro-ben...)
Affinity DataKi:  320nM. Assay description: Binding affinity against human gonadotropin-releasing hormone receptor
In DepthDetails ArticlePubMed