BDBM50127772 2-Chloro-N-[2-(2,2,2-trifluoro-1-hydroxy-1-trifluoromethyl-ethyl)-naphthalen-1-yl]-benzamide::CHEMBL49551
SMILES OC(c1ccc2ccccc2c1NC(=O)c1ccccc1Cl)(C(F)(F)F)C(F)(F)F
InChI Key InChIKey=PNKAHHOPMVBWPR-UHFFFAOYSA-N
Data  1 EC50
  Tab Delimited (TSV)   2D SDfile   Computed 3D by Vconf -m prep SDfile
Find this compound or compounds like it in BindingDB:
Activity Spreadsheet -- Enzyme Inhibition Constant Data from BindingDB
Found 1 hit for monomerid = 50127772
TargetATP-sensitive inward rectifier potassium channel 11(Homo sapiens (Human))
Abbott Laboratories
Curated by ChEMBL
LigandPNGBDBM50127772(2-Chloro-N-[2-(2,2,2-trifluoro-1-hydroxy-1-trifluo...)
Affinity DataEC50:  2.04E+3nM. Assay description: Potassium channel opening activity in vitro using LtK cells transfected with Kir6.2/SUR2B exon 17
In DepthDetails ArticlePubMed