BDBM50128447 1-(3,4-Dichloro-benzoyl)-6,7-dihydroxy-isoquinoline-3-carboxylic acid::CHEMBL301887
SMILES OC(=O)c1cc2cc(O)c(O)cc2c(n1)C(=O)c1ccc(Cl)c(Cl)c1
InChI Key InChIKey=LYQQOYQMUUKWFA-UHFFFAOYSA-N
Data  1 KI
  Tab Delimited (TSV)   2D SDfile   Computed 3D by Vconf -m prep SDfile
Find this compound or compounds like it in BindingDB:
Activity Spreadsheet -- Enzyme Inhibition Constant Data from BindingDB
Found 1 hit for monomerid = 50128447
TargetInsulin-like growth factor-binding protein 3(Homo sapiens (Human))
Neurocrine Biosciences
Curated by ChEMBL
LigandPNGBDBM50128447(1-(3,4-Dichloro-benzoyl)-6,7-dihydroxy-isoquinolin...)
Affinity DataKi:  29nM. Assay description: Ability to displace Insulin-Like Growth Factor (IGF-I) from its binding to human insulin-like growth factor binding protein 3 (hIGFBP-3)
In DepthDetails ArticlePubMed