BDBM50128584 CHEMBL77270::Cyclohexyl-carbamic acid m-tolyl ester
SMILES Cc1cccc(OC(=O)NC2CCCCC2)c1
InChI Key InChIKey=HVJIDJLSBZMPDP-UHFFFAOYSA-N
Data  2 IC50
  Tab Delimited (TSV)   2D SDfile   Computed 3D by Vconf -m prep SDfile
Find this compound or compounds like it in BindingDB:
Activity Spreadsheet -- Enzyme Inhibition Constant Data from BindingDB
Found 2 hits for monomerid = 50128584
TargetFatty-acid amide hydrolase 1 [30-579](Rattus norvegicus (rat))
Università
Curated by ChEMBL
LigandPNGBDBM50128584(CHEMBL77270 | Cyclohexyl-carbamic acid m-tolyl est...)
Affinity DataIC50:  813nM. Assay description: Inhibition of [3H]anandamide binding to fatty acid amide hydrolase of rat brain membrane
In DepthDetails ArticlePubMed
TargetFatty-acid amide hydrolase 1 [30-579](Rattus norvegicus (rat))
Università
Curated by ChEMBL
LigandPNGBDBM50128584(CHEMBL77270 | Cyclohexyl-carbamic acid m-tolyl est...)
Affinity DataIC50:  808nM. Assay description: Fatty acid amide hydrolase inhibitory activity in rat brain membrane using [3H]-anandamide as a substrate
In DepthDetails ArticlePubMed