BDBM50130777 (4-Bromo-phenyl)-(4-{6-[(3-hydroxy-propyl)-methyl-amino]-hexyloxy}-phenyl)-methanone; fumarate::CHEMBL114910::CHEMBL611487
SMILES CN(CCCO)CCCCCCOc1ccc(cc1)C(=O)c1ccc(Br)cc1
InChI Key InChIKey=SATDRNPWLIWVOP-UHFFFAOYSA-N
Data  3 IC50
  Tab Delimited (TSV)   2D SDfile   Computed 3D by Vconf -m prep SDfile
Find this compound or compounds like it in BindingDB:
Activity Spreadsheet -- Enzyme Inhibition Constant Data from BindingDB
Found 3 hits for monomerid = 50130777
TargetLanosterol synthase(Homo sapiens (Human))
F. Hoffmann-La Roche
Curated by ChEMBL
LigandPNGBDBM50130777((4-Bromo-phenyl)-(4-{6-[(3-hydroxy-propyl)-methyl-...)
Affinity DataIC50:  15.7nM. Assay description: In vitro inhibition of human 2,3-oxidosqualene cyclase.
In DepthDetails ArticlePubMed
TargetLanosterol synthase(Homo sapiens (Human))
F. Hoffmann-La Roche
Curated by ChEMBL
LigandPNGBDBM50130777((4-Bromo-phenyl)-(4-{6-[(3-hydroxy-propyl)-methyl-...)
Affinity DataIC50:  28.8nM. Assay description: Inhibition of oxidosqualene cyclase
In DepthDetails ArticlePubMed
TargetLanosterol synthase(Homo sapiens (Human))
F. Hoffmann-La Roche
Curated by ChEMBL
LigandPNGBDBM50130777((4-Bromo-phenyl)-(4-{6-[(3-hydroxy-propyl)-methyl-...)
Affinity DataIC50:  16nM. Assay description: Inhibition of oxidosqualene cyclase
In DepthDetails ArticlePubMed