BDBM50132413 1-(5-tert-Butyl-2-p-tolyl-2H-pyrazol-3-yl)-3-[3-methoxy-4-(2-morpholin-4-yl-ethoxy)-naphthalen-1-yl]-urea::CHEMBL104973
SMILES COc1cc(NC(=O)Nc2cc(nn2-c2ccc(C)cc2)C(C)(C)C)c2ccccc2c1OCCN1CCOCC1
InChI Key InChIKey=SNOHGEVGQIQRCN-UHFFFAOYSA-N
Data  1 Kd  1 Koff  2 Kon
  Tab Delimited (TSV)   2D SDfile   Computed 3D by Vconf -m prep SDfile
Find this compound or compounds like it in BindingDB:
Activity Spreadsheet -- Enzyme Inhibition Constant Data from BindingDB
Found 3 hits for monomerid = 50132413
TargetMitogen-activated protein kinase 14(Homo sapiens (Human))
Boehringer Ingelheim Pharmaceuticals
Curated by ChEMBL
LigandPNGBDBM50132413(1-(5-tert-Butyl-2-p-tolyl-2H-pyrazol-3-yl)-3-[3-me...)
Affinity DataKoff:  1.07E+4s-1Assay Description:Binding affinity for Mitogen-activated protein kinase p38 alpha
In DepthDetails ArticlePubMed
TargetMitogen-activated protein kinase 14(Homo sapiens (Human))
Boehringer Ingelheim Pharmaceuticals
Curated by ChEMBL
LigandPNGBDBM50132413(1-(5-tert-Butyl-2-p-tolyl-2H-pyrazol-3-yl)-3-[3-me...)
Affinity DataKon:  0.000150M-1s-1 Koff:  1.07E+4s-1Assay Description:Binding affinity for Mitogen-activated protein kinase p38 alpha
In DepthDetails ArticlePubMed
TargetMitogen-activated protein kinase 14(Homo sapiens (Human))
Boehringer Ingelheim Pharmaceuticals
Curated by ChEMBL
LigandPNGBDBM50132413(1-(5-tert-Butyl-2-p-tolyl-2H-pyrazol-3-yl)-3-[3-me...)
Affinity DataKd:  14nM. Assay description: Binding affinity for Mitogen-activated protein kinase p38 alpha
In DepthDetails ArticlePubMed