BDBM50132557 CHEMBL3633959
SMILES O=C(N1CCCn2nc(COc3ccccc3)cc12)c1ccno1
InChI Key InChIKey=IWBFTOGNHZBBLC-UHFFFAOYSA-N
Data  2 EC50
  Tab Delimited (TSV)   2D SDfile   Computed 3D by Vconf -m prep SDfile
Find this compound or compounds like it in BindingDB:
Activity Spreadsheet -- Enzyme Inhibition Constant Data from BindingDB
Found 2 hits for monomerid = 50132557
TargetMetabotropic glutamate receptor 5(Homo sapiens (Human))
Vanderbilt University Medical Center
Curated by ChEMBL
LigandPNGBDBM50132557(CHEMBL3633959)
Affinity DataEC50:  2.75E+3nM. Assay description: Inhibition of bovine trypsin by chromogenic assay using Bzl-L-Arg-pNA as chromogenic substrate
In DepthDetails ArticlePubMed
TargetMetabotropic glutamate receptor 5(Homo sapiens (Human))
Vanderbilt University Medical Center
Curated by ChEMBL
LigandPNGBDBM50132557(CHEMBL3633959)
Affinity DataEC50:  2.78E+3nM. Assay description: In vitro binding affinity for PPAR-alpha
In DepthDetails ArticlePubMed