BDBM50133493 (R)-3-(3,4-Dihydroxy-phenyl)-2-[(E)-3-(3,4-dihydroxy-phenyl)-acryloylamino]-propionic acid::3-(3,4-dihydroxy-phenyl)-2-[3-(3,4-dihydroxy-phenyl)-acryloylamino]-propionic acid::CHEMBL115421
SMILES OC(=O)[C@@H](Cc1ccc(O)c(O)c1)NC(=O)\C=C\c1ccc(O)c(O)c1
InChI Key InChIKey=GPZFXSWMDFBRGS-MJRJWQSSSA-N
Data  2 IC50
  Tab Delimited (TSV)   2D SDfile   Computed 3D by Vconf -m prep SDfile
Find this compound or compounds like it in BindingDB:
Activity Spreadsheet -- Enzyme Inhibition Constant Data from BindingDB
Found 2 hits for monomerid = 50133493
TargetAmyloid-beta precursor protein(Homo sapiens (Human))
University Of Tsukuba
Curated by ChEMBL
LigandPNGBDBM50133493((R)-3-(3,4-Dihydroxy-phenyl)-2-[(E)-3-(3,4-dihydro...)
Affinity DataIC50:  1.60E+3nM. Assay description: Inhibition of amyloid beta (1 to 42) (unknown origin) aggregation after 24 hrs by thioflavin T fluorescence assay
In DepthDetails ArticlePubMed
TargetTyrosine-protein kinase Lck(Homo sapiens (Human))
Mogam Biotechnology Research Institute
Curated by ChEMBL
LigandPNGBDBM50133493((R)-3-(3,4-Dihydroxy-phenyl)-2-[(E)-3-(3,4-dihydro...)
Affinity DataIC50:  2.00E+4nM. Assay description: Inhibition of binding to p56 Lck tyrosine kinase SH2 domain
In DepthDetails ArticlePubMed