BDBM50134995 1-(5-hydroxy-2-(2-hydroxy-3-(propylamino)propoxy)phenyl)-3-phenylpropan-1-one::1-[5-Hydroxy-2-(2-hydroxy-3-propylamino-propoxy)-phenyl]-3-phenyl-propan-1-one::5-Hydroxy Propafenone::CHEMBL1264
SMILES CCCNCC(O)COc1ccc(O)cc1C(=O)CCc1ccccc1
InChI Key InChIKey=LUTWDNUXHDYZRA-UHFFFAOYSA-N
Data  1 IC50  1 EC50
  Tab Delimited (TSV)   2D SDfile   Computed 3D by Vconf -m prep SDfile
Find this compound or compounds like it in BindingDB:
Activity Spreadsheet -- Enzyme Inhibition Constant Data from BindingDB
Found 2 hits for monomerid = 50134995
TargetATP-dependent translocase ABCB1(Homo sapiens (Human))
University Of Vienna
Curated by ChEMBL
LigandPNGBDBM50134995(1-(5-hydroxy-2-(2-hydroxy-3-(propylamino)propoxy)p...)
Affinity DataEC50:  3.02E+3nM. Assay description: Inhibition of P-glycoprotein expressed in MDR CCRF vcr1000 cells by daunorubicin efflux assay
In DepthDetails ArticlePubMed
TargetPotassium voltage-gated channel subfamily H member 2(Homo sapiens (Human))
China Pharmaceutical University
Curated by ChEMBL
LigandPNGBDBM50134995(1-(5-hydroxy-2-(2-hydroxy-3-(propylamino)propoxy)p...)
Affinity DataIC50:  4.00E+4nM. Assay description: Inhibitory concentration against IKr potassium channel
In DepthDetails ArticlePubMed