BDBM501362 US11021511, Compound 6a
SMILES CO[C@@H]1[C@H]2CO[P@](S)(=O)O[C@@H]3[C@@H](CO[P@@](S)(=O)O[C@H]1[C@@H](O2)n1cnc2c1nc(N)[nH]c2=O)O[C@H]([C@@H]3F)n1cnc2c(N)ncnc12
InChI Key
Data  1 IC50  1 Kd  1 EC50
  Tab Delimited (TSV)   2D SDfile   Computed 3D by Vconf -m prep SDfile
Find this compound or compounds like it in BindingDB:
Activity Spreadsheet -- Enzyme Inhibition Constant Data from BindingDB
Found 3 hits for monomerid = 501362
TargetStimulator of interferon genes protein [139-379,H232R](Homo sapiens (Human))
Janssen Biotech
US Patent
LigandPNGBDBM501362(US11021511, Compound 6a)
Affinity DataIC50: <10nM. Assay description: The human STING SPA binding assay measures displacement of tritium labeled 2′,3′cGAMP (cyclic (guanosine-(2′→5′)-monoph...
Ligand InfoPC cidPC sid
In DepthDetails US Patent
TargetStimulator of interferon genes protein [139-379,H232R](Homo sapiens (Human))
Janssen Biotech
US Patent
LigandPNGBDBM501362(US11021511, Compound 6a)
Affinity DataKd:  6nM. Assay description: Compounds were analyzed on an S200 biacore SPR instrument (GE Healthcare). E. coli produced truncated STING protein was immobilized on a series S str...
Ligand InfoPC cidPC sid
In DepthDetails US Patent
TargetStimulator of interferon genes protein [139-379,H232R](Homo sapiens (Human))
Janssen Biotech
US Patent
LigandPNGBDBM501362(US11021511, Compound 6a)
Affinity DataEC50:  53nM. Assay description: Agonism of the human STING pathway is assessed in THP1-ISG cells (Invivogen, cat #thp-isg) derived from human THP1 monocyte cell line by stable integ...
Ligand InfoPC cidPC sid
In DepthDetails US Patent