BDBM50136902 CHEMBL155448::[4-(2-Amino-phenylamino)-2-chloro-phenyl]-phenyl-methanone
SMILES Nc1ccccc1Nc1ccc(C(=O)c2ccccc2)c(Cl)c1
InChI Key InChIKey=ITHPNVNBELRBSK-UHFFFAOYSA-N
Data  1 IC50
  Tab Delimited (TSV)   2D SDfile   Computed 3D by Vconf -m prep SDfile
Find this compound or compounds like it in BindingDB:
Activity Spreadsheet -- Enzyme Inhibition Constant Data from BindingDB
Found 1 hit for monomerid = 50136902
TargetMitogen-activated protein kinase 14(Homo sapiens (Human))
Leo Pharma
Curated by ChEMBL
LigandPNGBDBM50136902(CHEMBL155448 | [4-(2-Amino-phenylamino)-2-chloro-p...)
Affinity DataIC50:  139nM. Assay description: In vitro inhibitory activity determined against human mitogen-activated protein kinase p38 alpha
In DepthDetails ArticlePubMed