BDBM50136980 CHEMBL154651::[(2-ammonio-3-mercaptopropanoyl)amino]acetate
SMILES [NH3+]C(CS)C(=O)NCC([O-])=O
InChI Key InChIKey=ZUKPVRWZDMRIEO-UHFFFAOYSA-N
Data  1 KI
  Tab Delimited (TSV)   2D SDfile   Computed 3D by Vconf -m prep SDfile
Find this compound or compounds like it in BindingDB:
Activity Spreadsheet -- Enzyme Inhibition Constant Data from BindingDB
Found 1 hit for monomerid = 50136980
TargetSolute carrier family 15 member 1(Homo sapiens (Human))
Martin-Luther-University Halle-Wittenberg
Curated by ChEMBL
LigandPNGBDBM50136980(CHEMBL154651 | [(2-ammonio-3-mercaptopropanoyl)ami...)
Affinity DataKi:  2.00E+5nM. Assay description: Inhibition constant (Ki) for human intestinal peptide carrier
In DepthDetails ArticlePubMed