BDBM50137894 (Biphenyl-4-sulfonyl)-methanesulfonic acid::(Biphenyl-4-sulfonylmethyl)-phosphonic acid::CHEMBL177822
SMILES OS(=O)(=O)CS(=O)(=O)c1ccc(cc1)-c1ccccc1
InChI Key InChIKey=WSHJFYVZLUNDJR-UHFFFAOYSA-N
Data  1 IC50
  Tab Delimited (TSV)   2D SDfile   Computed 3D by Vconf -m prep SDfile
Find this compound or compounds like it in BindingDB:
Activity Spreadsheet -- Enzyme Inhibition Constant Data from BindingDB
Found 1 hit for monomerid = 50137894
TargetReplication protein E1(Human papillomavirus type 11)
Boehringer Ingelheim (Canada)
Curated by ChEMBL
LigandPNGBDBM50137894((Biphenyl-4-sulfonyl)-methanesulfonic acid | (Biph...)
Affinity DataIC50:  3.20E+4nM. Assay description: Ability to inhibit in vitro ATPase activity of human papillomavirus (HPV6) E1 helicase
In DepthDetails ArticlePubMed