BDBM50138439 CHEMBL3752543
SMILES C(CCCNCc1cc2ccccc2o1)CCCNc1c2CCCc2nc2ccccc12
InChI Key InChIKey=CPIMBZDXMLRJFA-UHFFFAOYSA-N
Data  2 IC50
  Tab Delimited (TSV)   2D SDfile   Computed 3D by Vconf -m prep SDfile
Find this compound or compounds like it in BindingDB:
Activity Spreadsheet -- Enzyme Inhibition Constant Data from BindingDB
Found 2 hits for monomerid = 50138439
TargetAcetylcholinesterase(Homo sapiens (Human))
China Pharmaceutical University
Curated by ChEMBL
LigandPNGBDBM50138439(CHEMBL3752543)
Affinity DataIC50:  11nM. Assay description: Inhibition of recombinant human AChE using acetylthiocholine iodide as substrate preincubated for 20 mins followed by substrate addition by Ellman's ...
In DepthDetails ArticlePubMed
TargetCholinesterase(Homo sapiens (Human))
China Pharmaceutical University
Curated by ChEMBL
LigandPNGBDBM50138439(CHEMBL3752543)
Affinity DataIC50:  2.5nM. Assay description: Inhibition of human serum BChE using butyrylthiocholine iodide as substrate preincubated for 20 mins followed by substrate addition by Ellman's metho...
In DepthDetails ArticlePubMed