BDBM50139758 (2-Naphthalen-2-yl-1-naphthalen-1-yl-2-oxo-ethyl)-phosphonic acid::1-(naphthalen-1-yl)-2-(naphthalen-2-yl)-2-oxoethylphosphonic acid::CHEMBL424224
SMILES OP(O)(=O)C(C(=O)c1ccc2ccccc2c1)c1cccc2ccccc12
InChI Key InChIKey=OFHMUASCSJJNNA-UHFFFAOYSA-N
Data  1 KI  2 IC50
PDB links: 1 PDB ID matches this monomer.
  Tab Delimited (TSV)   2D SDfile   Computed 3D by Vconf -m prep SDfile
Find this compound or compounds like it in BindingDB:
Activity Spreadsheet -- Enzyme Inhibition Constant Data from BindingDB
Found 3 hits for monomerid = 50139758
TargetChymase(Homo sapiens (Human))
Indian Institute Of Technology (Bhu)
Curated by ChEMBL
LigandPNGBDBM50139758((2-Naphthalen-2-yl-1-naphthalen-1-yl-2-oxo-ethyl)-...)
Affinity DataKi:  2.30nM. Assay description: Inhibition of chymase in human mast cells using Suc-Ala-Ala-Pro-Phe-(p-nitroanilide) as substrate for 15 mins by spectrophotometric method
In DepthDetails ArticlePubMed
TargetCathepsin G(Homo sapiens (Human))
Johnson & Johnson Pharmaceutical Research & Development
Curated by ChEMBL
LigandPNGBDBM50139758((2-Naphthalen-2-yl-1-naphthalen-1-yl-2-oxo-ethyl)-...)
Affinity DataIC50:  4.10E+3nM. Assay description: Inhibitory activity of the compound against human Cathepsin G
TargetProstatic acid phosphatase(Homo sapiens (Human))
TBA
Curated by ChEMBL
LigandPNGBDBM50139758((2-Naphthalen-2-yl-1-naphthalen-1-yl-2-oxo-ethyl)-...)
Affinity DataIC50:  6.00E+3nM. Assay description: Tested for 50% of inhibition of Osteoclastic acid phosphatase (OAP) activity, determined using dose-response curve
In DepthDetails Article