BDBM50139938 2-(4-Benzoyl-1-methyl-1H-pyrrol-2-yl)-N-hydroxy-acetamide::CHEMBL12986
SMILES Cn1cc(cc1CC(=O)NO)C(=O)c1ccccc1
InChI Key InChIKey=ZCYQIKNHENWQEO-UHFFFAOYSA-N
Data  2 IC50
  Tab Delimited (TSV)   2D SDfile   Computed 3D by Vconf -m prep SDfile
Find this compound or compounds like it in BindingDB:
Activity Spreadsheet -- Enzyme Inhibition Constant Data from BindingDB
Found 2 hits for monomerid = 50139938
TargetHistone deacetylase 2b(Zea mays)
Sapienza University Of Rome
Curated by ChEMBL
LigandPNGBDBM50139938(2-(4-Benzoyl-1-methyl-1H-pyrrol-2-yl)-N-hydroxy-ac...)
Affinity DataIC50:  3.47E+4nM. Assay description: Inhibitory concentration against histone deacetylase HD2 enzyme.Checked by Author
In DepthDetails ArticlePubMed
TargetHistone deacetylase 2b(Zea mays)
Sapienza University Of Rome
Curated by ChEMBL
LigandPNGBDBM50139938(2-(4-Benzoyl-1-methyl-1H-pyrrol-2-yl)-N-hydroxy-ac...)
Affinity DataIC50:  3.47E+4nM. Assay description: Inhibitory concentration against histone deacetylase HD2 enzyme.Checked by Author
In DepthDetails ArticlePubMed