BDBM50142308 2,2-Bis-[4-(difluoro-phosphono-methyl)-benzyl]-malonic acid monomethyl ester::CHEMBL9070
SMILES COC(=O)C(Cc1ccc(cc1)C(F)(F)P(O)(O)=O)(Cc1ccc(cc1)C(F)(F)P(O)(O)=O)C(O)=O
InChI Key InChIKey=LZXTZCBHFMWPFD-UHFFFAOYSA-N
Data  3 IC50
  Tab Delimited (TSV)   2D SDfile   Computed 3D by Vconf -m prep SDfile
Find this compound or compounds like it in BindingDB:
Activity Spreadsheet -- Enzyme Inhibition Constant Data from BindingDB
Found 3 hits for monomerid = 50142308
TargetTyrosine-protein phosphatase non-receptor type 1(Homo sapiens (Human))
Merck Frosst Centre For Therapeutic Research
Curated by ChEMBL
LigandPNGBDBM50142308(2,2-Bis-[4-(difluoro-phosphono-methyl)-benzyl]-mal...)
Affinity DataIC50:  390nM. Assay description: In vitro inhibitory activity against protein tyrosine phosphatase 1B (PTP1B) was determined in fluorescein diphosphate (FDP) assay
In DepthDetails ArticlePubMed
TargetReceptor-type tyrosine-protein phosphatase C(Homo sapiens (Human))
Merck Frosst Centre For Therapeutic Research
Curated by ChEMBL
LigandPNGBDBM50142308(2,2-Bis-[4-(difluoro-phosphono-methyl)-benzyl]-mal...)
Affinity DataIC50: >5.00E+4nM. Assay description: In vitro inhibitory activity against CD45 protein-tyrosine phosphatase
In DepthDetails ArticlePubMed
TargetTyrosine-protein phosphatase non-receptor type 1(Homo sapiens (Human))
Merck Frosst Centre For Therapeutic Research
Curated by ChEMBL
LigandPNGBDBM50142308(2,2-Bis-[4-(difluoro-phosphono-methyl)-benzyl]-mal...)
Affinity DataIC50:  3.80E+3nM. Assay description: In vitro inhibitory activity against Protein tyrosine phosphatase 1B (PTP1B) overexpressed in intact Sf9 cell assay
In DepthDetails ArticlePubMed