BDBM50143423 CHEMBL176350::Sodium; 2-hydroxy-5-(4-nitro-phenylazo)-benzoate
SMILES Oc1ccc(cc1C([O-])=O)N=Nc1ccc(cc1)[N+]([O-])=O
InChI Key InChIKey=YVJPMMYYRNHJAU-UHFFFAOYSA-M
Data  2 IC50
  Tab Delimited (TSV)   2D SDfile   Computed 3D by Vconf -m prep SDfile
Find this compound or compounds like it in BindingDB:
Activity Spreadsheet -- Enzyme Inhibition Constant Data from BindingDB
Found 2 hits for monomerid = 50143423
TargetTyrosine-protein phosphatase 1(Saccharomyces cerevisiae)
Inha University
Curated by ChEMBL
LigandPNGBDBM50143423(CHEMBL176350 | Sodium; 2-hydroxy-5-(4-nitro-phenyl...)
Affinity DataIC50:  6.30E+5nM. Assay description: Inhibitory activity against Saccharomyces cerevisiae Tyrosine phosphatase 1
In DepthDetails ArticlePubMed
TargetTyrosine-protein phosphatase non-receptor type 1(Homo sapiens (Human))
Inha University
Curated by ChEMBL
LigandPNGBDBM50143423(CHEMBL176350 | Sodium; 2-hydroxy-5-(4-nitro-phenyl...)
Affinity DataIC50:  2.10E+5nM. Assay description: Inhibition of human PTPase 1B
In DepthDetails ArticlePubMed