BDBM50144620 CHEMBL73706::[4-(5-{4-[Bis-(4-fluoro-phenyl)-methyl]-piperazin-1-ylmethyl}-furan-2-yl)-but-3-ynyl]-N-hydroxyurea
SMILES NC(=O)N(O)CCC#Cc1ccc(CN2CCN(CC2)C(c2ccc(F)cc2)c2ccc(F)cc2)o1
InChI Key InChIKey=CJHFYNOETGOKCU-UHFFFAOYSA-N
Data  1 KI  2 IC50
  Tab Delimited (TSV)   2D SDfile   Computed 3D by Vconf -m prep SDfile
Find this compound or compounds like it in BindingDB:
Activity Spreadsheet -- Enzyme Inhibition Constant Data from BindingDB
Found 3 hits for monomerid = 50144620
TargetHistamine H1 receptor(Homo sapiens (Human))
Ucb Pharma
Curated by ChEMBL
LigandPNGBDBM50144620(CHEMBL73706 | [4-(5-{4-[Bis-(4-fluoro-phenyl)-meth...)
Affinity DataKi:  550nM. Assay description: In vitro binding affinity towards histamine H1 receptor expressed in CHO-K1 cells
In DepthDetails ArticlePubMed
TargetPolyunsaturated fatty acid 5-lipoxygenase(Rattus norvegicus)
Ucb Pharma
Curated by ChEMBL
LigandPNGBDBM50144620(CHEMBL73706 | [4-(5-{4-[Bis-(4-fluoro-phenyl)-meth...)
Affinity DataIC50: <200nM. Assay description: In vitro inhibitory activity against 5-lipoxygenase in an RBL-2H3 cell lysate
In DepthDetails ArticlePubMed
TargetPolyunsaturated fatty acid 5-lipoxygenase(Homo sapiens (Human))
Ucb Pharma
Curated by ChEMBL
LigandPNGBDBM50144620(CHEMBL73706 | [4-(5-{4-[Bis-(4-fluoro-phenyl)-meth...)
Affinity DataIC50:  170nM. Assay description: In vitro inhibitory activity against 5-lipoxygenase in a human whole blood assay
In DepthDetails ArticlePubMed