BDBM50144732 CHEMBL75791::N*4*-(4-Chloro-phenyl)-6-phenyl-pyrimidine-2,4-diamine
SMILES Nc1nc(Nc2ccc(Cl)cc2)cc(n1)-c1ccccc1
InChI Key InChIKey=NBMVJRWLSOWOPA-UHFFFAOYSA-N
Data  1 IC50
  Tab Delimited (TSV)   2D SDfile   Computed 3D by Vconf -m prep SDfile
Find this compound or compounds like it in BindingDB:
Activity Spreadsheet -- Enzyme Inhibition Constant Data from BindingDB
Found 1 hit for monomerid = 50144732
Target1-acyl-sn-glycerol-3-phosphate acyltransferase beta(Homo sapiens (Human))
Cell Therapeutics
Curated by ChEMBL
LigandPNGBDBM50144732(CHEMBL75791 | N*4*-(4-Chloro-phenyl)-6-phenyl-pyri...)
Affinity DataIC50:  1.10E+3nM. Assay description: Inhibitory activity against Lysophosphatidic acid acyltransferase-beta expressed in Sf9 insect cell membranes
In DepthDetails ArticlePubMed