BDBM50145803 4-Hydroxy-2-(4-hydroxy-benzoyl)-benzoic acid::CHEMBL82108
SMILES OC(=O)c1ccc(O)cc1C(=O)c1ccc(O)cc1
InChI Key InChIKey=LXMGRIAWDMCWFH-UHFFFAOYSA-N
Data  1 Kd
  Tab Delimited (TSV)   2D SDfile   Computed 3D by Vconf -m prep SDfile
Find this compound or compounds like it in BindingDB:
Activity Spreadsheet -- Enzyme Inhibition Constant Data from BindingDB
Found 1 hit for monomerid = 50145803
TargetGenome polyprotein(Hepatitis C virus)
Schering-Plough Research Institute
Curated by ChEMBL
LigandPNGBDBM50145803(4-Hydroxy-2-(4-hydroxy-benzoyl)-benzoic acid | CHE...)
Affinity DataKd: >1.00E+4nM. Assay description: Dissociation constant for HCV NS3 protease substrate binding site
In DepthDetails ArticlePubMed