BDBM50146804 (dibutylamino)carbonylphosphonic acid::CHEMBL96438
SMILES CCCCN(CCCC)C(=O)P(O)(O)=O
InChI Key InChIKey=NEQAQLUTBGWNLE-UHFFFAOYSA-N
Data  5 IC50
  Tab Delimited (TSV)   2D SDfile   Computed 3D by Vconf -m prep SDfile
Find this compound or compounds like it in BindingDB:
Activity Spreadsheet -- Enzyme Inhibition Constant Data from BindingDB
Found 5 hits for monomerid = 50146804
TargetNeutrophil collagenase(Homo sapiens (Human))
The Hebrew University Of Jerusalem
Curated by ChEMBL
LigandPNGBDBM50146804((dibutylamino)carbonylphosphonic acid | CHEMBL9643...)
Affinity DataIC50:  9.00E+4nM. Assay description: In vitro inhibitory activity against recombinant matrix metalloprotease-8 was determined
In DepthDetails ArticlePubMed
TargetMatrix metalloproteinase-9(Homo sapiens (Human))
The Hebrew University Of Jerusalem
Curated by ChEMBL
LigandPNGBDBM50146804((dibutylamino)carbonylphosphonic acid | CHEMBL9643...)
Affinity DataIC50: >1.00E+5nM. Assay description: In vitro inhibitory activity against recombinant matrix metalloprotease-9 was determined
In DepthDetails ArticlePubMed
TargetInterstitial collagenase(Homo sapiens (Human))
The Hebrew University Of Jerusalem
Curated by ChEMBL
LigandPNGBDBM50146804((dibutylamino)carbonylphosphonic acid | CHEMBL9643...)
Affinity DataIC50:  7.00E+4nM. Assay description: In vitro inhibitory activity against recombinant matrix metalloprotease-1 was determined
In DepthDetails ArticlePubMed
Target72 kDa type IV collagenase(Homo sapiens (Human))
The Hebrew University Of Jerusalem
Curated by ChEMBL
LigandPNGBDBM50146804((dibutylamino)carbonylphosphonic acid | CHEMBL9643...)
Affinity DataIC50:  5.00E+4nM. Assay description: In vitro inhibitory activity against recombinant matrix metalloprotease-2 was determined
In DepthDetails ArticlePubMed
TargetStromelysin-1(Homo sapiens (Human))
The Hebrew University Of Jerusalem
Curated by ChEMBL
LigandPNGBDBM50146804((dibutylamino)carbonylphosphonic acid | CHEMBL9643...)
Affinity DataIC50:  3.00E+4nM. Assay description: In vitro inhibitory activity against recombinant matrix metalloprotease-3 was determined
In DepthDetails ArticlePubMed