BDBM50146929 CHEMBL3765805
SMILES CC(C)[C@H](CO)Nc1nc(NCc2ccc(Cl)cc2)c2ncn(C(C)C)c2n1
InChI Key InChIKey=JEABWAOASJZMJP-INIZCTEOSA-N
Data  1 IC50
  Tab Delimited (TSV)   2D SDfile   Computed 3D by Vconf -m prep SDfile
Find this compound or compounds like it in BindingDB:
Activity Spreadsheet -- Enzyme Inhibition Constant Data from BindingDB
Found 1 hit for monomerid = 50146929
TargetCyclin-dependent kinase 2/G1/S-specific cyclin-E1(Homo sapiens (Human))
University Of Tours
Curated by ChEMBL
LigandPNGBDBM50146929(CHEMBL3765805)
Affinity DataIC50:  35nM. Assay description: Inhibition of CDK2/Cyclin E (unknown origin)
In DepthDetails ArticlePubMed