BDBM50147230 CHEMBL319636::methyl 2-[1-[4-(5-fluoro-2-methylphenylcarboxamido)benzoyl]spiro[2,3,4,5-tetrahydro-1H-benzo[b]azepine-4,1'-(2'-cyclopentene)]-3-ylcarboxamido]acetate
SMILES COC(=O)CNC(=O)C1=CC2(CC1)CCN(C(=O)c1ccc(NC(=O)c3cc(F)ccc3C)cc1)c1ccccc1C2
InChI Key InChIKey=LCAJHIWAYHQYBE-UHFFFAOYSA-N
Data  4 IC50
  Tab Delimited (TSV)   2D SDfile   Computed 3D by Vconf -m prep SDfile
Find this compound or compounds like it in BindingDB:
Activity Spreadsheet -- Enzyme Inhibition Constant Data from BindingDB
Found 4 hits for monomerid = 50147230
TargetVasopressin V2 receptor(Homo sapiens (Human))
Johnson And Johnson Pharmaceutical Research And Development
Curated by ChEMBL
LigandPNGBDBM50147230(CHEMBL319636 | methyl 2-[1-[4-(5-fluoro-2-methylph...)
Affinity DataIC50:  440nM. Assay description: Evaluated for accumulation of cAMP in transfected HEK293 cells expressing human vasopressin V2 receptor
In DepthDetails ArticlePubMed
TargetVasopressin V1a receptor(Homo sapiens (Human))
Johnson And Johnson Pharmaceutical Research And Development
Curated by ChEMBL
LigandPNGBDBM50147230(CHEMBL319636 | methyl 2-[1-[4-(5-fluoro-2-methylph...)
Affinity DataIC50:  7nM. Assay description: Binding affinity measured by inhibition of 3[H] AVP binding to cloned human vasopressin V1a receptor
In DepthDetails ArticlePubMed
TargetVasopressin V2 receptor(Homo sapiens (Human))
Johnson And Johnson Pharmaceutical Research And Development
Curated by ChEMBL
LigandPNGBDBM50147230(CHEMBL319636 | methyl 2-[1-[4-(5-fluoro-2-methylph...)
Affinity DataIC50:  10nM. Assay description: Binding affinity measured by inhibition of 3[H] AVP binding to cloned human vasopressin V2 receptor
In DepthDetails ArticlePubMed
TargetVasopressin V1a receptor(Homo sapiens (Human))
Johnson And Johnson Pharmaceutical Research And Development
Curated by ChEMBL
LigandPNGBDBM50147230(CHEMBL319636 | methyl 2-[1-[4-(5-fluoro-2-methylph...)
Affinity DataIC50:  135nM. Assay description: Evaluated for intracellular calcium mobilization in HEK293 cells transfected to express human vasopressin V1a receptor
In DepthDetails ArticlePubMed