BDBM50148452 2-{4-[2-(5,5,8,8-Tetramethyl-5,6,7,8-tetrahydro-naphthalen-2-yloxy)-ethoxy]-benzyl}-malonic acid monomethyl ester::CHEMBL116920
SMILES COC(=O)C(Cc1ccc(OCCOc2ccc3c(c2)C(C)(C)CCC3(C)C)cc1)C(O)=O
InChI Key InChIKey=VDQRCWMYDWTXDN-UHFFFAOYSA-N
Data  1 EC50
  Tab Delimited (TSV)   2D SDfile   Computed 3D by Vconf -m prep SDfile
Find this compound or compounds like it in BindingDB:
Activity Spreadsheet -- Enzyme Inhibition Constant Data from BindingDB
Found 1 hit for monomerid = 50148452
TargetPeroxisome proliferator-activated receptor gamma(Homo sapiens (Human))
Research Institute Of Tsinghua University
Curated by ChEMBL
LigandPNGBDBM50148452(2-{4-[2-(5,5,8,8-Tetramethyl-5,6,7,8-tetrahydro-na...)
Affinity DataEC50:  90nM. Assay description: In vitro transcription activation on human peroxisome proliferator activated receptor-gamma (PPAR gamma)
In DepthDetails ArticlePubMed