BDBM50149242 CHEMBL330959::{(E)-4-(4-Chloro-phenyl)-4-[4-(3-{4-[(Z)-1-(4-chloro-phenyl)-4-dimethylamino-but-1-enyl]-phenyl}-propyl)-phenyl]-but-3-enyl}-dimethyl-amine
SMILES CN(C)CC\C=C(\c1ccc(Cl)cc1)c1ccc(CCCc2ccc(cc2)C(=C\CCN(C)C)\c2ccc(Cl)cc2)cc1
InChI Key InChIKey=AJIRDGXQFQFHOO-IMZRBMHKSA-N
Data  1 IC50
  Tab Delimited (TSV)   2D SDfile   Computed 3D by Vconf -m prep SDfile
Find this compound or compounds like it in BindingDB:
Activity Spreadsheet -- Enzyme Inhibition Constant Data from BindingDB
Found 1 hit for monomerid = 50149242
TargetBcl-2-like protein 1(Homo sapiens (Human))
Sunesis Pharmaceuticals
Curated by ChEMBL
LigandPNGBDBM50149242(CHEMBL330959 | {(E)-4-(4-Chloro-phenyl)-4-[4-(3-{4...)
Affinity DataIC50:  1.00E+4nM. Assay description: Inhibitory concentration against B-Cell Lymphoma xL (Bcl-xL) Bak-peptide binding region
In DepthDetails ArticlePubMed