BDBM50150613 CHEMBL179992::CHEMBL182645::[(1R,4S,7aR)-1-(1,5-dimethylhexyl)-4,7a-dimethyloctahydro-1H-inden-4-yl]methyl dihydrogen phosphate
SMILES CC(C)CCC[C@@H](C)[C@H]1CCC2[C@]1(C)CCCC2(C)COP(O)(O)=O
InChI Key InChIKey=MWCJYWGELHFGRI-MQPDGSBLSA-N
Data  4 IC50
  Tab Delimited (TSV)   2D SDfile   Computed 3D by Vconf -m prep SDfile
Find this compound or compounds like it in BindingDB:
Activity Spreadsheet -- Enzyme Inhibition Constant Data from BindingDB
Found 4 hits for monomerid = 50150613
TargetM-phase inducer phosphatase 2(Homo sapiens (Human))
The University Of Tokyo
Curated by ChEMBL
LigandPNGBDBM50150613(CHEMBL179992 | CHEMBL182645 | [(1R,4S,7aR)-1-(1,5-...)
Affinity DataIC50:  3.00E+3nM. Assay description: Inhibitory concentration agaunst dual-specificity phosphatase Cell division cycle (Cdc) 25B
In DepthDetails ArticlePubMed
TargetM-phase inducer phosphatase 2(Homo sapiens (Human))
The University Of Tokyo
Curated by ChEMBL
LigandPNGBDBM50150613(CHEMBL179992 | CHEMBL182645 | [(1R,4S,7aR)-1-(1,5-...)
Affinity DataIC50:  3.70E+3nM. Assay description: Inhibitory concentration agaunst dual-specificity phosphatase Cell division cycle (Cdc) 25B
In DepthDetails ArticlePubMed
TargetM-phase inducer phosphatase 1(Homo sapiens (Human))
The University Of Tokyo
Curated by ChEMBL
LigandPNGBDBM50150613(CHEMBL179992 | CHEMBL182645 | [(1R,4S,7aR)-1-(1,5-...)
Affinity DataIC50:  900nM. Assay description: Inhibitory concentration againsts dual-specificity phosphatase Cell division cycle (Cdc) 25A
In DepthDetails ArticlePubMed
TargetM-phase inducer phosphatase 1(Homo sapiens (Human))
The University Of Tokyo
Curated by ChEMBL
LigandPNGBDBM50150613(CHEMBL179992 | CHEMBL182645 | [(1R,4S,7aR)-1-(1,5-...)
Affinity DataIC50:  700nM. Assay description: Inhibitory concentration againsts dual-specificity phosphatase Cell division cycle (Cdc) 25A
In DepthDetails ArticlePubMed