BDBM50150722 3-(4-Azido-phenyl)-6-(4-methylsulfanyl-phenyl)-4-phenyl-pyran-2-one::CHEMBL185820
SMILES CSc1ccc(cc1)-c1cc(-c2ccccc2)c(-c2ccc(cc2)N=[N+]=[N-])c(=O)o1
InChI Key InChIKey=ZDIDWNMWMFIASD-UHFFFAOYSA-N
Data  2 IC50
  Tab Delimited (TSV)   2D SDfile   Computed 3D by Vconf -m prep SDfile
Find this compound or compounds like it in BindingDB:
Activity Spreadsheet -- Enzyme Inhibition Constant Data from BindingDB
Found 2 hits for monomerid = 50150722
TargetProstaglandin G/H synthase 2(Ovis aries (Sheep))
University Of Alberta
Curated by ChEMBL
LigandPNGBDBM50150722(3-(4-Azido-phenyl)-6-(4-methylsulfanyl-phenyl)-4-p...)
Affinity DataIC50:  380nM. Assay description: Inhibition of ovine Prostaglandin G/H synthase 2
In DepthDetails ArticlePubMed
TargetProstaglandin G/H synthase 1(Ovis aries (Sheep))
University Of Alberta
Curated by ChEMBL
LigandPNGBDBM50150722(3-(4-Azido-phenyl)-6-(4-methylsulfanyl-phenyl)-4-p...)
Affinity DataIC50:  3.00E+4nM. Assay description: Inhibition of ovine Prostaglandin G/H synthase 1
In DepthDetails ArticlePubMed