BDBM50150734 6-(4-Ethoxy-phenyl)-3-(4-methanesulfonyl-phenyl)-4-phenyl-pyran-2-one::CHEMBL184767
SMILES CCOc1ccc(cc1)-c1cc(-c2ccccc2)c(-c2ccc(cc2)S(C)(=O)=O)c(=O)o1
InChI Key InChIKey=UPZNCVBAWLLXRV-UHFFFAOYSA-N
Data  2 IC50
  Tab Delimited (TSV)   2D SDfile   Computed 3D by Vconf -m prep SDfile
Find this compound or compounds like it in BindingDB:
Activity Spreadsheet -- Enzyme Inhibition Constant Data from BindingDB
Found 2 hits for monomerid = 50150734
TargetProstaglandin G/H synthase 2(Ovis aries (Sheep))
University Of Alberta
Curated by ChEMBL
LigandPNGBDBM50150734(6-(4-Ethoxy-phenyl)-3-(4-methanesulfonyl-phenyl)-4...)
Affinity DataIC50:  50nM. Assay description: Inhibition of ovine Prostaglandin G/H synthase 2
In DepthDetails ArticlePubMed
TargetProstaglandin G/H synthase 1(Ovis aries (Sheep))
University Of Alberta
Curated by ChEMBL
LigandPNGBDBM50150734(6-(4-Ethoxy-phenyl)-3-(4-methanesulfonyl-phenyl)-4...)
Affinity DataIC50: >1.00E+5nM. Assay description: Inhibition of ovine Prostaglandin G/H synthase 1
In DepthDetails ArticlePubMed