BDBM50150738 3-(4-Azido-phenyl)-6-(4-methoxy-phenyl)-4-phenyl-pyran-2-one::CHEMBL363052
SMILES COc1ccc(cc1)-c1cc(-c2ccccc2)c(-c2ccc(cc2)N=[N+]=[N-])c(=O)o1
InChI Key InChIKey=HADLCHPZNIUBQY-UHFFFAOYSA-N
Data  2 IC50
  Tab Delimited (TSV)   2D SDfile   Computed 3D by Vconf -m prep SDfile
Find this compound or compounds like it in BindingDB:
Activity Spreadsheet -- Enzyme Inhibition Constant Data from BindingDB
Found 2 hits for monomerid = 50150738
TargetProstaglandin G/H synthase 2(Ovis aries (Sheep))
University Of Alberta
Curated by ChEMBL
LigandPNGBDBM50150738(3-(4-Azido-phenyl)-6-(4-methoxy-phenyl)-4-phenyl-p...)
Affinity DataIC50:  500nM. Assay description: Inhibition of ovine Prostaglandin G/H synthase 2
In DepthDetails ArticlePubMed
TargetProstaglandin G/H synthase 1(Ovis aries (Sheep))
University Of Alberta
Curated by ChEMBL
LigandPNGBDBM50150738(3-(4-Azido-phenyl)-6-(4-methoxy-phenyl)-4-phenyl-p...)
Affinity DataIC50: >1.00E+5nM. Assay description: Inhibition of ovine Prostaglandin G/H synthase 1
In DepthDetails ArticlePubMed