BDBM50151482 (1R,2R,3R,5R,6R)-2-Amino-3-[(S)-1-(3,4-dichloro-phenyl)-butoxy]-6-fluoro-bicyclo[3.1.0]hexane-2,6-dicarboxylic acid::CHEMBL181710
SMILES CCC[C@H](O[C@@H]1C[C@@H]2[C@@H]([C@@]2(F)C(O)=O)[C@]1(N)C(O)=O)c1ccc(Cl)c(Cl)c1
InChI Key InChIKey=DMWXAHQIYDWDOA-FUSQRTACSA-N
Data  1 KI
  Tab Delimited (TSV)   2D SDfile   Computed 3D by Vconf -m prep SDfile
Find this compound or compounds like it in BindingDB:
Activity Spreadsheet -- Enzyme Inhibition Constant Data from BindingDB
Found 1 hit for monomerid = 50151482
TargetMetabotropic glutamate receptor 2(Homo sapiens (Human))
Taisho Pharmaceutical
Curated by ChEMBL
LigandPNGBDBM50151482((1R,2R,3R,5R,6R)-2-Amino-3-[(S)-1-(3,4-dichloro-ph...)
Affinity DataKi:  3.05nM. Assay description: Binding affinity towards metabotropic glutamate receptor 2 of rat expressed in CHO cells was determined by using [3H]-MGS0008
In DepthDetails ArticlePubMed