BDBM50155758 Imbricatolic Acid
SMILES [H][C@@]12CCC(=C)[C@H](CC[C@H](C)CCO)[C@@]1(C)CCC[C@]2(C)C(O)=O
InChI Key InChIKey=NSRKLZRKJJQJLD-BEUFEYIVSA-N
Data  1 IC50
  Tab Delimited (TSV)   2D SDfile   Computed 3D by Vconf -m prep SDfile
Find this compound or compounds like it in BindingDB:
Activity Spreadsheet -- Enzyme Inhibition Constant Data from BindingDB
Found 1 hit for monomerid = 50155758
TargetTyrosine-protein phosphatase non-receptor type 1(Homo sapiens (Human))
University Of Lucknow
Curated by ChEMBL
LigandPNGBDBM50155758(Imbricatolic Acid)
Affinity DataIC50:  8.80E+3nM. Assay description: Inhibition of human recombinant PTP-1B using IR5 insulin receptor residues as substrate after 30 mins by malachite green assay
In DepthDetails ArticlePubMed