BDBM50156704 2-{[4-(2-butynyloxy)phenyl]sulfonyl}-2-phenyl-N-hydroxyacetamide::CHEMBL222309
SMILES CC#CCOc1ccc(cc1)S(=O)(=O)C(C(=O)NO)c1ccccc1
InChI Key InChIKey=XWQYRXPGPDOWAJ-UHFFFAOYSA-N
Data  4 IC50
  Tab Delimited (TSV)   2D SDfile   Computed 3D by Vconf -m prep SDfile
Find this compound or compounds like it in BindingDB:
Activity Spreadsheet -- Enzyme Inhibition Constant Data from BindingDB
Found 4 hits for monomerid = 50156704
TargetMatrix metalloproteinase-9(Homo sapiens (Human))
Wyeth Research
Curated by ChEMBL
LigandPNGBDBM50156704(2-{[4-(2-butynyloxy)phenyl]sulfonyl}-2-phenyl-N-hy...)
Affinity DataIC50:  124nM. Assay description: Inhibition of MMP9
In DepthDetails ArticlePubMed
TargetDisintegrin and metalloproteinase domain-containing protein 17(Homo sapiens (Human))
Wyeth Research
Curated by ChEMBL
LigandPNGBDBM50156704(2-{[4-(2-butynyloxy)phenyl]sulfonyl}-2-phenyl-N-hy...)
Affinity DataIC50:  94nM. Assay description: Inhibition of TACE
In DepthDetails ArticlePubMed
TargetInterstitial collagenase(Homo sapiens (Human))
Wyeth Research
Curated by ChEMBL
LigandPNGBDBM50156704(2-{[4-(2-butynyloxy)phenyl]sulfonyl}-2-phenyl-N-hy...)
Affinity DataIC50:  4.57E+3nM. Assay description: Inhibition of MMP1
In DepthDetails ArticlePubMed
TargetCollagenase 3(Homo sapiens (Human))
Wyeth Research
Curated by ChEMBL
LigandPNGBDBM50156704(2-{[4-(2-butynyloxy)phenyl]sulfonyl}-2-phenyl-N-hy...)
Affinity DataIC50:  68nM. Assay description: Inhibition of MMP13
In DepthDetails ArticlePubMed